{"text_format":"1","workbook":"xlsx","n_sheets":3,"sheets":["Calculator","Lookup","Rates"],"not_rendered":{"charts":0,"images":0,"macros":1,"external_links":1,"defined_names":5,"comments":0,"pivot_tables":0},"unopened":[],"bounds":{"document_bytes":16777216,"sheet_cells":100000,"rows_first":2000,"rows_last":500,"rows_between":2000,"halvings":0,"cell_chars":16384,"cell_head_chars":4096},"cells_cut":0,"cells_raw":0,"read":"whole","date_system":"1900"}

{"sheet":"Calculator","index":0,"n_rows":154,"n_cols":12,"rows_kept":154,"cut":false,"hidden":false,"merged":[[62,2,62,6],[79,2,79,6],[96,2,96,6],[113,2,113,6],[81,2,81,5],[84,4,86,5],[87,2,87,5],[97,2,97,5],[98,2,98,5],[63,2,63,5],[64,2,64,5],[67,4,69,5],[70,2,70,5],[80,2,80,5],[138,2,138,5],[101,4,103,5],[104,2,104,5],[114,2,114,5],[115,2,115,5],[118,4,120,5],[130,2,130,6],[121,2,121,5],[131,2,131,5],[132,2,132,5],[135,4,137,5],[53,2,53,5],[29,2,29,5],[36,2,36,5],[19,2,19,5],[33,4,35,5],[50,4,52,5],[30,2,30,5],[47,2,47,5],[28,2,28,6],[45,2,45,6],[21,4,21,6],[22,4,22,6],[26,2,26,4],[43,2,43,5],[46,2,46,5],[24,9,31,9],[1,9,2,9],[2,0,2,4],[9,0,9,2],[4,9,11,9],[12,2,12,5],[16,4,18,5],[13,2,13,5],[20,9,21,9],[16,9,18,9],[11,2,11,6],[3,0,4,2]]}
["Early Childhood Teacher Supplement Calculator"]
[]
["How much early childhood teacher supplement can this service expect to receive?"]
["PLEASE NOTE: THE ECTS FOR RURAL SERVICES WITH ROTATIONAL GROUPS MAY NOT CALCULATE CORRECTLY IN THIS CALCULATOR",null,null,null,null,null,null,null,null,null,null,3]
[null,null,null,null,null,null,null,null,null,"This tool calculates the amount of early childhood teacher supplement (ECTS) an eligible service provider can receive for each group taught by an eligible teacher. \n\nIf you wish to clear the information you have entered in this calculator and re-calculate the ECTS for another service, please click the \"CLEAR ALL\" button.\n\nPlease note that the ECTS amount produced by this calculator are indicative only and if you want confirmation of the amount to be received, you should contact your regional office.\n"]
[]
[]
["Is your service funded at the Standard or Rural rate?\nPlease select one of the following options:\n1. ST for Standard service\n2. RU for Rural service"]
[]
["For each group, please enter below the names of the teachers who are delivering the kindergarten program and who are eligible for the early childhood teacher supplement*."]
[]
["Group 1","Name of group:"]
["Total number of children in this group"]
["Total number of kindergarten hours received by this group",15,"The Early Childhood Teacher Supplement is capped at 15 hours per group "]
[]
["Teacher Name","Level \n(select from the drop down list)","Total contact hours delivered by teacher to this group","Terms"]
[null,null,null,null,"Contact hours per teacher cannot be more than 'total number of kindergarten hours received by the group'",null,null,null,null,"* To be eligible for the early childhood teacher supplement, the teacher must be classified and validated as level 2.3 or above under the VECTEA or EEEA 2016 (or equivalent). For the full eligibility criteria please refer to page the Kindergarten Guide"]
[]
[]
[]
[null,"% of Grant","Applicable rate **","Breakdown",null,null,null,null,null,"**  For a list of the annual supplement rates and their definitions, please click HERE"]
["Supplement at level 3 rate",{"$f":"MIN(1,SUMPRODUCT((B17:B19>3)*C17:C19*D17:D19)/60)","v":0},{"$f":"IF($B$8=\"\",0,(IF(AND(B13>9,B13<18),INDEX([1]Lookup!$F$3:$F$6,MATCH(1,($B$8=[1]Lookup!$C$3:$C$6)*(3=[1]Lookup!$D$3:$D$6),0)),(IF(B13<10,INDEX([1]Lookup!$G$3:$G$6,MATCH(1,($B$8=[1]Lookup!$C$3:$C$6)*(3=[1]Lookup!$D$3:$D$6),0)),INDEX([1]Lookup!$E$3:$E$6,MATCH(1,($B$8=[1]Lookup!$C$3:$C$6)*(3=[1]Lookup!$D$3:$D$6),0)))))))","v":0},{"$f":"IF(AND(B$8=\"RU\",B$13<18),(C22*B22),(B22*C22*B$13))","v":0},"The proportion of the grant allocated to Level 3 teachers is calculated first   "]
["Supplement at level 2.5 rate",{"$f":"MIN(SUMPRODUCT((B17:B19>2.4)*(B17:B19<3)*C17:C19*D17:D19)/60,1-B22)","v":0},{"$f":"IF($B$8=\"\",0,(IF(AND(B13>9,B13<18),INDEX([1]Lookup!$F$3:$F$6,MATCH(1,($B$8=[1]Lookup!$C$3:$C$6)*(2=[1]Lookup!$D$3:$D$6),0)),(IF(B13<10,INDEX([1]Lookup!$G$3:$G$6,MATCH(1,($B$8=[1]Lookup!$C$3:$C$6)*(2=[1]Lookup!$D$3:$D$6),0)),INDEX([1]Lookup!$E$3:$E$6,MATCH(1,($B$8=[1]Lookup!$C$3:$C$6)*(2=[1]Lookup!$D$3:$D$6),0)))))))","v":0},{"$f":"IF(AND(B$8=\"RU\",B$13<18),(C23*B23),(B23*C23*B$13))","v":0}]
["Supplement at level 2.4 rate",{"$f":"MIN(SUMPRODUCT((B17:B19>2.3)*(B17:B19<2.5)*C17:C19*D17:D19)/60,1-(B22+B23))","v":0},{"$f":"IF($B$8=\"\",0,(IF(AND(B13>9,B13<18),INDEX([1]Lookup!$F$3:$F$10,MATCH(1,($B$8=[1]Lookup!$C$3:$C$10)*(5=[1]Lookup!$D$3:$D$10),0)),(IF(B13<10,INDEX([1]Lookup!$G$3:$G$10,MATCH(1,($B$8=[1]Lookup!$C$3:$C$10)*(5=[1]Lookup!$D$3:$D$10),0)),INDEX([1]Lookup!$E$3:$E$10,MATCH(1,($B$8=[1]Lookup!$C$3:$C$10)*(5=[1]Lookup!$D$3:$D$10),0)))))))","v":0},{"$f":"IF(AND(B$8=\"RU\",B$13<18),(C24*B24),(B24*C24*B$13))","v":0}]
["Supplement at level 2.3 rate",{"$f":"MIN(SUMPRODUCT((B17:B19>2.2)*(B17:B19<2.4)*C17:C19*D17:D19)/60,1-(B22+B23+B24))","v":0},{"$f":"IF($B$8=\"\",0,(IF(AND(B13>9,B13<18),INDEX([1]Lookup!$F$3:$F$8,MATCH(1,($B$8=[1]Lookup!$C$3:$C$8)*(4=[1]Lookup!$D$3:$D$8),0)),(IF(B13<10,INDEX([1]Lookup!$G$3:$G$8,MATCH(1,($B$8=[1]Lookup!$C$3:$C$8)*(4=[1]Lookup!$D$3:$D$8),0)),INDEX([1]Lookup!$E$3:$E$8,MATCH(1,($B$8=[1]Lookup!$C$3:$C$8)*(4=[1]Lookup!$D$3:$D$8),0)))))))","v":0},{"$f":"IF(AND(B$8=\"RU\",B$13<18),(C25*B25),(B25*C25*B$13))","v":0},null,null,null,null,null,"The ECTS amount is capped at 15 hours for 4 terms for each group, irrespective of the number of teachers.\n\nThe grant amount is proportionally reduced if an eligible teacher delivers the program to the group for fewer than 15 hours per week or fewer than four terms.\n\nWhen more than one eligible teacher is delivering the program during the year, the proportion of hours and terms delivered by Level 3 teachers is calculated first and then the proportion at Level 2. \n\nThe proportion for each level is multiplied by the number of children in the group at the appropriate rate. \n"]
[]
["Supplement Amount - Group 1",{"$f":"IF(OR(B14=0,COUNTIF(C17:C19,0)=\">0\"),0,IF(AND($B$8=\"RU\", B13>9,B13<18),SUMPRODUCT(B22:B25,C22:C25),IF(AND($B$8= \"RU\",B13<10),SUMPRODUCT(B22:B25,C22:C25),SUMPRODUCT(B22:B25,C22:C25)*B13)))","v":0},"The amount calculated is based on the capped limit of 15 hours for 4 terms per group"]
[]
["Group 2","Name of group:"]
["Total number of children in this group"]
["Total number of kindergarten hours received by this group",15]
[]
["Teacher Name","Level \n(select from the drop down list)","Total contact hours delivered by teacher to this group","Terms"]
[]
[]
[]
[]
[null,"% of Grant","Applicable rate **","Breakdown"]
["Supplement at level 3 rate",{"$f":"MIN(1,SUMPRODUCT((B34:B36>3)*C34:C36*D34:D36)/60)","v":0},{"$f":"IF($B$8=\"\",0,(IF(AND(B30>9,B30<18),INDEX([1]Lookup!$F$3:$F$6,MATCH(1,($B$8=[1]Lookup!$C$3:$C$6)*(3=[1]Lookup!$D$3:$D$6),0)),(IF(B30<10,INDEX([1]Lookup!$G$3:$G$6,MATCH(1,($B$8=[1]Lookup!$C$3:$C$6)*(3=[1]Lookup!$D$3:$D$6),0)),INDEX([1]Lookup!$E$3:$E$6,MATCH(1,($B$8=[1]Lookup!$C$3:$C$6)*(3=[1]Lookup!$D$3:$D$6),0)))))))","v":0},{"$f":"IF(AND(B$8=\"RU\",B$30<18),(C39*B39),(B39*C39*B$30))","v":0}]
["Supplement at level 2.5 rate",{"$f":"MIN(SUMPRODUCT((B34:B36>2.4)*(B34:B36<3)*C34:C36*D34:D36)/60,1-B39)","v":0},{"$f":"IF($B$8=\"\",0,(IF(AND(B30>9,B30<18),INDEX([1]Lookup!$F$3:$F$6,MATCH(1,($B$8=[1]Lookup!$C$3:$C$6)*(2=[1]Lookup!$D$3:$D$6),0)),(IF(B30<10,INDEX([1]Lookup!$G$3:$G$6,MATCH(1,($B$8=[1]Lookup!$C$3:$C$6)*(2=[1]Lookup!$D$3:$D$6),0)),INDEX([1]Lookup!$E$3:$E$6,MATCH(1,($B$8=[1]Lookup!$C$3:$C$6)*(2=[1]Lookup!$D$3:$D$6),0)))))))","v":0},{"$f":"IF(AND(B$8=\"RU\",B$30<18),(C40*B40),(B40*C40*B$30))","v":0}]
["Supplement at level 2.4 rate",{"$f":"MIN(SUMPRODUCT((B34:B36>2.3)*(B34:B36<2.5)*C34:C36*D34:D36)/60,1-(B39+B40))","v":0},{"$f":"IF($B$8=\"\",0,(IF(AND(B30>9,B30<18),INDEX([1]Lookup!$F$3:$F$10,MATCH(1,($B$8=[1]Lookup!$C$3:$C$10)*(5=[1]Lookup!$D$3:$D$10),0)),(IF(B30<10,INDEX([1]Lookup!$G$3:$G$10,MATCH(1,($B$8=[1]Lookup!$C$3:$C$10)*(5=[1]Lookup!$D$3:$D$10),0)),INDEX([1]Lookup!$E$3:$E$10,MATCH(1,($B$8=[1]Lookup!$C$3:$C$10)*(5=[1]Lookup!$D$3:$D$10),0)))))))","v":0},{"$f":"IF(AND(B$8=\"RU\",B$30<18),(C41*B41),(B41*C41*B$30))","v":0}]
["Supplement at level 2.3 rate",{"$f":"MIN(SUMPRODUCT((B34:B36>2.2)*(B34:B36<2.4)*C34:C36*D34:D36)/60,1-(B39+B40+B41))","v":0},{"$f":"IF($B$8=\"\",0,(IF(AND(B30>9,B30<18),INDEX([1]Lookup!$F$3:$F$8,MATCH(1,($B$8=[1]Lookup!$C$3:$C$8)*(4=[1]Lookup!$D$3:$D$8),0)),(IF(B30<10,INDEX([1]Lookup!$G$3:$G$8,MATCH(1,($B$8=[1]Lookup!$C$3:$C$8)*(4=[1]Lookup!$D$3:$D$8),0)),INDEX([1]Lookup!$E$3:$E$8,MATCH(1,($B$8=[1]Lookup!$C$3:$C$8)*(4=[1]Lookup!$D$3:$D$8),0)))))))","v":0},{"$f":"IF(AND(B$8=\"RU\",B$30<18),(C42*B42),(B42*C42*B$30))","v":0}]
[]
["Supplement Amount - Group 2",{"$f":"IF(OR(B31=0,COUNTIF(C34:C36,0)=\">0\"),0,IF(AND($B$8=\"RU\", B30>9,B30<18),SUMPRODUCT(B39:B42,C39:C42),IF(AND($B$8= \"RU\",B30<10),SUMPRODUCT(B39:B42,C39:C42),SUMPRODUCT(B39:B42,C39:C42)*B30)))","v":0}]
[]
["Group 3","Name of group:"]
["Total number of children in this group"]
["Total number of kindergarten hours received by this group",15]
[]
["Teacher Name","Level \n(select from the drop down list)","Total contact hours delivered by teacher to this group","Terms"]
[]
[]
[]
[]
[null,"% of Grant","Applicable rate **","Breakdown"]
["Supplement at level 3 rate",{"$f":"MIN(1,SUMPRODUCT((B51:B53>3)*C51:C53*D51:D53)/60)","v":0},{"$f":"IF($B$8=\"\",0,(IF(AND(B47>9,B47<18),INDEX([1]Lookup!$F$3:$F$6,MATCH(1,($B$8=[1]Lookup!$C$3:$C$6)*(3=[1]Lookup!$D$3:$D$6),0)),(IF(B47<10,INDEX([1]Lookup!$G$3:$G$6,MATCH(1,($B$8=[1]Lookup!$C$3:$C$6)*(3=[1]Lookup!$D$3:$D$6),0)),INDEX([1]Lookup!$E$3:$E$6,MATCH(1,($B$8=[1]Lookup!$C$3:$C$6)*(3=[1]Lookup!$D$3:$D$6),0)))))))","v":0},{"$f":"IF(AND(B$8=\"RU\",B$47<18),(C56*B56),(B56*C56*B$47))","v":0}]
["Supplement at level 2.5 rate",{"$f":"MIN(SUMPRODUCT((B51:B53>2.4)*(B51:B53<3)*C51:C53*D51:D53)/60,1-B56)","v":0},{"$f":"IF($B$8=\"\",0,(IF(AND(B47>9,B47<18),INDEX([1]Lookup!$F$3:$F$6,MATCH(1,($B$8=[1]Lookup!$C$3:$C$6)*(2=[1]Lookup!$D$3:$D$6),0)),(IF(B47<10,INDEX([1]Lookup!$G$3:$G$6,MATCH(1,($B$8=[1]Lookup!$C$3:$C$6)*(2=[1]Lookup!$D$3:$D$6),0)),INDEX([1]Lookup!$E$3:$E$6,MATCH(1,($B$8=[1]Lookup!$C$3:$C$6)*(2=[1]Lookup!$D$3:$D$6),0)))))))","v":0},{"$f":"IF(AND(B$8=\"RU\",B$47<18),(C57*B57),(B57*C57*B$47))","v":0}]
["Supplement at level 2.4 rate",{"$f":"MIN(SUMPRODUCT((B51:B53>2.3)*(B51:B53<2.5)*C51:C53*D51:D53)/60,1-(B56+B57))","v":0},{"$f":"IF($B$8=\"\",0,(IF(AND(B47>9,B47<18),INDEX([1]Lookup!$F$3:$F$10,MATCH(1,($B$8=[1]Lookup!$C$3:$C$10)*(5=[1]Lookup!$D$3:$D$10),0)),(IF(B47<10,INDEX([1]Lookup!$G$3:$G$10,MATCH(1,($B$8=[1]Lookup!$C$3:$C$10)*(5=[1]Lookup!$D$3:$D$10),0)),INDEX([1]Lookup!$E$3:$E$10,MATCH(1,($B$8=[1]Lookup!$C$3:$C$10)*(5=[1]Lookup!$D$3:$D$10),0)))))))","v":0},{"$f":"IF(AND(B$8=\"RU\",B$47<18),(C58*B58),(B58*C58*B$47))","v":0}]
["Supplement at level 2.3 rate",{"$f":"MIN(SUMPRODUCT((B51:B53>2.2)*(B51:B53<2.4)*C51:C53*D51:D53)/60,1-(B56+B57+B58))","v":0},{"$f":"IF($B$8=\"\",0,(IF(AND(B47>9,B47<18),INDEX([1]Lookup!$F$3:$F$8,MATCH(1,($B$8=[1]Lookup!$C$3:$C$8)*(4=[1]Lookup!$D$3:$D$8),0)),(IF(B47<10,INDEX([1]Lookup!$G$3:$G$8,MATCH(1,($B$8=[1]Lookup!$C$3:$C$8)*(4=[1]Lookup!$D$3:$D$8),0)),INDEX([1]Lookup!$E$3:$E$8,MATCH(1,($B$8=[1]Lookup!$C$3:$C$8)*(4=[1]Lookup!$D$3:$D$8),0)))))))","v":0},{"$f":"IF(AND(B$8=\"RU\",B$47<18),(C59*B59),(B59*C59*B$47))","v":0}]
[]
["Supplement Amount - Group 3",{"$f":"IF(OR(B48=0,COUNTIF(C51:C53,0)=\">0\"),0,IF(AND($B$8=\"RU\", B47>9,B47<18),SUMPRODUCT(B56:B59,C56:C59),IF(AND($B$8= \"RU\",B47<10),SUMPRODUCT(B56:B59,C56:C59),SUMPRODUCT(B56:B59,C56:C59)*B47)))","v":0}]
[]
["Group 4","Name of group:"]
["Total number of children in this group"]
["Total number of kindergarten hours received by this group",15]
[]
["Teacher Name","Level \n(select from the drop down list)","Total contact hours delivered by teacher to this group","Terms"]
[]
[]
[]
[]
[null,"% of Grant","Applicable rate **","Breakdown"]
["Supplement at level 3 rate",{"$f":"MIN(1,SUMPRODUCT((B68:B70>3)*C68:C70*D68:D70)/60)","v":0},{"$f":"IF($B$8=\"\",0,(IF(AND(B64>9,B64<18),INDEX([1]Lookup!$F$3:$F$6,MATCH(1,($B$8=[1]Lookup!$C$3:$C$6)*(3=[1]Lookup!$D$3:$D$6),0)),(IF(B64<10,INDEX([1]Lookup!$G$3:$G$6,MATCH(1,($B$8=[1]Lookup!$C$3:$C$6)*(3=[1]Lookup!$D$3:$D$6),0)),INDEX([1]Lookup!$E$3:$E$6,MATCH(1,($B$8=[1]Lookup!$C$3:$C$6)*(3=[1]Lookup!$D$3:$D$6),0)))))))","v":0},{"$f":"IF(AND(B$8=\"RU\",B$64<18),(C73*B73),(B73*C73*B$64))","v":0}]
["Supplement at level 2.5 rate",{"$f":"MIN(SUMPRODUCT((B68:B70>2.4)*(B68:B70<3)*C68:C70*D68:D70)/60,1-B73)","v":0},{"$f":"IF($B$8=\"\",0,(IF(AND(B64>9,B64<18),INDEX([1]Lookup!$F$3:$F$6,MATCH(1,($B$8=[1]Lookup!$C$3:$C$6)*(2=[1]Lookup!$D$3:$D$6),0)),(IF(B64<10,INDEX([1]Lookup!$G$3:$G$6,MATCH(1,($B$8=[1]Lookup!$C$3:$C$6)*(2=[1]Lookup!$D$3:$D$6),0)),INDEX([1]Lookup!$E$3:$E$6,MATCH(1,($B$8=[1]Lookup!$C$3:$C$6)*(2=[1]Lookup!$D$3:$D$6),0)))))))","v":0},{"$f":"IF(AND(B$8=\"RU\",B$64<18),(C74*B74),(B74*C74*B$64))","v":0}]
["Supplement at level 2.4 rate",{"$f":"MIN(SUMPRODUCT((B68:B70>2.3)*(B68:B70<2.5)*C68:C70*D68:D70)/60,1-(B73+B74))","v":0},{"$f":"IF($B$8=\"\",0,(IF(AND(B64>9,B64<18),INDEX([1]Lookup!$F$3:$F$10,MATCH(1,($B$8=[1]Lookup!$C$3:$C$10)*(5=[1]Lookup!$D$3:$D$10),0)),(IF(B64<10,INDEX([1]Lookup!$G$3:$G$10,MATCH(1,($B$8=[1]Lookup!$C$3:$C$10)*(5=[1]Lookup!$D$3:$D$10),0)),INDEX([1]Lookup!$E$3:$E$10,MATCH(1,($B$8=[1]Lookup!$C$3:$C$10)*(5=[1]Lookup!$D$3:$D$10),0)))))))","v":0},{"$f":"IF(AND(B$8=\"RU\",B$64<18),(C75*B75),(B75*C75*B$64))","v":0}]
["Supplement at level 2.3 rate",{"$f":"MIN(SUMPRODUCT((B68:B70>2.2)*(B68:B70<2.4)*C68:C70*D68:D70)/60,1-(B73+B74+B75))","v":0},{"$f":"IF($B$8=\"\",0,(IF(AND(B64>9,B64<18),INDEX([1]Lookup!$F$3:$F$8,MATCH(1,($B$8=[1]Lookup!$C$3:$C$8)*(4=[1]Lookup!$D$3:$D$8),0)),(IF(B64<10,INDEX([1]Lookup!$G$3:$G$8,MATCH(1,($B$8=[1]Lookup!$C$3:$C$8)*(4=[1]Lookup!$D$3:$D$8),0)),INDEX([1]Lookup!$E$3:$E$8,MATCH(1,($B$8=[1]Lookup!$C$3:$C$8)*(4=[1]Lookup!$D$3:$D$8),0)))))))","v":0},{"$f":"IF(AND(B$8=\"RU\",B$64<18),(C76*B76),(B76*C76*B$64))","v":0}]
[]
["Supplement Amount - Group 4",{"$f":"IF(OR(B65=0,COUNTIF(C68:C70,0)=\">0\"),0,IF(AND($B$8=\"RU\", B64>9,B64<18),SUMPRODUCT(B73:B76,C73:C76),IF(AND($B$8= \"RU\",B64<10),SUMPRODUCT(B73:B76,C73:C76),SUMPRODUCT(B73:B76,C73:C76)*B64)))","v":0}]
[]
["Group 5","Name of group:"]
["Total number of children in this group"]
["Total number of kindergarten hours received by this group",15]
[]
["Teacher Name","Level \n(select from the drop down list)","Total contact hours delivered by teacher to this group","Terms"]
[]
[]
[]
[]
[null,"% of Grant","Applicable rate **","Breakdown"]
["Supplement at level 3 rate",{"$f":"MIN(1,SUMPRODUCT((B85:B87>3)*C85:C87*D85:D87)/60)","v":0},{"$f":"IF($B$8=\"\",0,(IF(AND(B81>9,B81<18),INDEX([1]Lookup!$F$3:$F$6,MATCH(1,($B$8=[1]Lookup!$C$3:$C$6)*(3=[1]Lookup!$D$3:$D$6),0)),(IF(B81<10,INDEX([1]Lookup!$G$3:$G$6,MATCH(1,($B$8=[1]Lookup!$C$3:$C$6)*(3=[1]Lookup!$D$3:$D$6),0)),INDEX([1]Lookup!$E$3:$E$6,MATCH(1,($B$8=[1]Lookup!$C$3:$C$6)*(3=[1]Lookup!$D$3:$D$6),0)))))))","v":0},{"$f":"IF(AND(B$8=\"RU\",B$81<18),(C90*B90),(B90*C90*B$81))","v":0}]
["Supplement at level 2.5 rate",{"$f":"MIN(SUMPRODUCT((B85:B87>2.4)*(B85:B87<3)*C85:C87*D85:D87)/60,1-B90)","v":0},{"$f":"IF($B$8=\"\",0,(IF(AND(B81>9,B81<18),INDEX([1]Lookup!$F$3:$F$6,MATCH(1,($B$8=[1]Lookup!$C$3:$C$6)*(2=[1]Lookup!$D$3:$D$6),0)),(IF(B81<10,INDEX([1]Lookup!$G$3:$G$6,MATCH(1,($B$8=[1]Lookup!$C$3:$C$6)*(2=[1]Lookup!$D$3:$D$6),0)),INDEX([1]Lookup!$E$3:$E$6,MATCH(1,($B$8=[1]Lookup!$C$3:$C$6)*(2=[1]Lookup!$D$3:$D$6),0)))))))","v":0},{"$f":"IF(AND(B$8=\"RU\",B$81<18),(C91*B91),(B91*C91*B$81))","v":0}]
["Supplement at level 2.4 rate",{"$f":"MIN(SUMPRODUCT((B85:B87>2.3)*(B85:B87<2.5)*C85:C87*D85:D87)/60,1-(B90+B91))","v":0},{"$f":"IF($B$8=\"\",0,(IF(AND(B81>9,B81<18),INDEX([1]Lookup!$F$3:$F$10,MATCH(1,($B$8=[1]Lookup!$C$3:$C$10)*(5=[1]Lookup!$D$3:$D$10),0)),(IF(B81<10,INDEX([1]Lookup!$G$3:$G$10,MATCH(1,($B$8=[1]Lookup!$C$3:$C$10)*(5=[1]Lookup!$D$3:$D$10),0)),INDEX([1]Lookup!$E$3:$E$10,MATCH(1,($B$8=[1]Lookup!$C$3:$C$10)*(5=[1]Lookup!$D$3:$D$10),0)))))))","v":0},{"$f":"IF(AND(B$8=\"RU\",B$81<18),(C92*B92),(B92*C92*B$81))","v":0}]
["Supplement at level 2.3 rate",{"$f":"MIN(SUMPRODUCT((B85:B87>2.2)*(B85:B87<2.4)*C85:C87*D85:D87)/60,1-(B90+B91+B92))","v":0},{"$f":"IF($B$8=\"\",0,(IF(AND(B81>9,B81<18),INDEX([1]Lookup!$F$3:$F$8,MATCH(1,($B$8=[1]Lookup!$C$3:$C$8)*(4=[1]Lookup!$D$3:$D$8),0)),(IF(B81<10,INDEX([1]Lookup!$G$3:$G$8,MATCH(1,($B$8=[1]Lookup!$C$3:$C$8)*(4=[1]Lookup!$D$3:$D$8),0)),INDEX([1]Lookup!$E$3:$E$8,MATCH(1,($B$8=[1]Lookup!$C$3:$C$8)*(4=[1]Lookup!$D$3:$D$8),0)))))))","v":0},{"$f":"IF(AND(B$8=\"RU\",B$81<18),(C93*B93),(B93*C93*B$81))","v":0}]
[]
["Supplement Amount - Group 5",{"$f":"IF(OR(B82=0,COUNTIF(C85:C87,0)=\">0\"),0,IF(AND($B$8=\"RU\", B81>9,B81<18),SUMPRODUCT(B90:B93,C90:C93),IF(AND($B$8= \"RU\",B81<10),SUMPRODUCT(B90:B93,C90:C93),SUMPRODUCT(B90:B93,C90:C93)*B81)))","v":0}]
[]
["Group 6","Name of group:"]
["Total number of children in this group"]
["Total number of kindergarten hours received by this group",15]
[]
["Teacher Name","Level \n(select from the drop down list)","Total contact hours delivered by teacher to this group","Terms"]
[]
[]
[]
[]
[null,"% of Grant","Applicable rate **","Breakdown"]
["Supplement at level 3 rate",{"$f":"MIN(1,SUMPRODUCT((B102:B104>3)*C102:C104*D102:D104)/60)","v":0},{"$f":"IF($B$8=\"\",0,(IF(AND(B98>9,B98<18),INDEX([1]Lookup!$F$3:$F$6,MATCH(1,($B$8=[1]Lookup!$C$3:$C$6)*(3=[1]Lookup!$D$3:$D$6),0)),(IF(B98<10,INDEX([1]Lookup!$G$3:$G$6,MATCH(1,($B$8=[1]Lookup!$C$3:$C$6)*(3=[1]Lookup!$D$3:$D$6),0)),INDEX([1]Lookup!$E$3:$E$6,MATCH(1,($B$8=[1]Lookup!$C$3:$C$6)*(3=[1]Lookup!$D$3:$D$6),0)))))))","v":0},{"$f":"IF(AND(B$8=\"RU\",B$98<18),(C107*B107),(B107*C107*B$98))","v":0}]
["Supplement at level 2.5 rate",{"$f":"MIN(SUMPRODUCT((B102:B104>2.4)*(B102:B104<3)*C102:C104*D102:D104)/60,1-B107)","v":0},{"$f":"IF($B$8=\"\",0,(IF(AND(B98>9,B98<18),INDEX([1]Lookup!$F$3:$F$6,MATCH(1,($B$8=[1]Lookup!$C$3:$C$6)*(2=[1]Lookup!$D$3:$D$6),0)),(IF(B98<10,INDEX([1]Lookup!$G$3:$G$6,MATCH(1,($B$8=[1]Lookup!$C$3:$C$6)*(2=[1]Lookup!$D$3:$D$6),0)),INDEX([1]Lookup!$E$3:$E$6,MATCH(1,($B$8=[1]Lookup!$C$3:$C$6)*(2=[1]Lookup!$D$3:$D$6),0)))))))","v":0},{"$f":"IF(AND(B$8=\"RU\",B$98<18),(C108*B108),(B108*C108*B$98))","v":0}]
["Supplement at level 2.4 rate",{"$f":"MIN(SUMPRODUCT((B102:B104>2.3)*(B102:B104<2.5)*C102:C104*D102:D104)/60,1-(B107+B108))","v":0},{"$f":"IF($B$8=\"\",0,(IF(AND(B98>9,B98<18),INDEX([1]Lookup!$F$3:$F$10,MATCH(1,($B$8=[1]Lookup!$C$3:$C$10)*(5=[1]Lookup!$D$3:$D$10),0)),(IF(B98<10,INDEX([1]Lookup!$G$3:$G$10,MATCH(1,($B$8=[1]Lookup!$C$3:$C$10)*(5=[1]Lookup!$D$3:$D$10),0)),INDEX([1]Lookup!$E$3:$E$10,MATCH(1,($B$8=[1]Lookup!$C$3:$C$10)*(5=[1]Lookup!$D$3:$D$10),0)))))))","v":0},{"$f":"IF(AND(B$8=\"RU\",B$98<18),(C109*B109),(B109*C109*B$98))","v":0}]
["Supplement at level 2.3 rate",{"$f":"MIN(SUMPRODUCT((B102:B104>2.2)*(B102:B104<2.4)*C102:C104*D102:D104)/60,1-(B107+B108+B109))","v":0},{"$f":"IF($B$8=\"\",0,(IF(AND(B98>9,B98<18),INDEX([1]Lookup!$F$3:$F$8,MATCH(1,($B$8=[1]Lookup!$C$3:$C$8)*(4=[1]Lookup!$D$3:$D$8),0)),(IF(B98<10,INDEX([1]Lookup!$G$3:$G$8,MATCH(1,($B$8=[1]Lookup!$C$3:$C$8)*(4=[1]Lookup!$D$3:$D$8),0)),INDEX([1]Lookup!$E$3:$E$8,MATCH(1,($B$8=[1]Lookup!$C$3:$C$8)*(4=[1]Lookup!$D$3:$D$8),0)))))))","v":0},{"$f":"IF(AND(B$8=\"RU\",B$98<18),(C110*B110),(B110*C110*B$98))","v":0}]
[]
["Supplement Amount - Group 6",{"$f":"IF(OR(B99=0,COUNTIF(C102:C104,0)=\">0\"),0,IF(AND($B$8=\"RU\", B98>9,B98<18),SUMPRODUCT(B107:B110,C107:C110),IF(AND($B$8= \"RU\",B98<10),SUMPRODUCT(B107:B110,C107:C110),SUMPRODUCT(B107:B110,C107:C110)*B98)))","v":0}]
[]
["Group 7","Name of group:"]
["Total number of children in this group"]
["Total number of kindergarten hours received by this group",15]
[]
["Teacher Name","Level \n(select from the drop down list)","Total contact hours delivered by teacher to this group","Terms"]
[]
[]
{"$rows_left_out":35}
{"sheet":"Lookup","index":1,"n_rows":22,"n_cols":7,"rows_kept":22,"cut":false,"hidden":true,"merged":[]}
[null,null,null,null,"18 or More","10 to 17","9 or less"]
[null,"Level","Funding Category","Code","Rate","Rate","Rate"]
[null,"Level 2.5","ST",2,243,243,243]
[null,"Level 2.5","RU",2,301,5418,5418]
[null,"level 3","ST",3,608,608,608]
[null,"level 3","RU",3,754,13572,13572]
[null,"level 2.3","ST",4,93,93,93]
[null,"level 2.3","RU",4,116,2088,2088]
[null,"level 2.4","ST",5,159,159,159]
[null,"level 2.4","RU",5,197,3546,3546]
[]
[null,"Drop down lists"]
[]
[null,"hours","Funding","Level","Group delivery type","Terms"]
[null,10.75,"ST",2.2999999999999998,"Yes",1]
[null,15,"RU",2.4,"No",2]
[null,null,null,2.5,null,3]
[null,null,null,3.1,null,4]
[null,null,null,3.2]
[null,null,null,3.3]
[null,null,null,3.4]
[null,null,null,3.5]

{"sheet":"Rates","index":2,"n_rows":13,"n_cols":7,"rows_kept":13,"cut":false,"hidden":false,"merged":[[3,1,5,4],[12,1,12,4]]}
[]
[null,"ANNUAL EARLY CHILDHOOD TEACHER SUPPLEMENT RATES"]
[]
[null,"Outlined below are the rates, per child, for service providers offering a kindergarten program in 2017"]
[]
[]
[]
[null,"Type of early childhood teacher supplement","Annual Level 2.3 supplement rate from 1 January 2019","Annual Level 2.4 supplement rate from 1 January 2019","Annual Level 2.5 supplement rate from 1 January 2019","Annual Level 3 supplement rate from 1 January 2019","Comments"]
[null,"Standard ",93,159,243,608]
[null,"Rural  18 or more children",116,197,301,754]
[null,"Rural  up to 17 children",2088,3546,5418,13572,"Flat Rate per service"]
[]
[null,"CLICK HERE TO RETURN TO FUNDING CALCULATOR"]